Information card for entry 7701104
Formula | C84 H51 B2 F30 N5 O3 Pd |
Calculated formula | C84 H51 B2 F30 N5 O3 Pd |
Title of publication | Imidazolyl-phenyl (IMP) anions: a modular structure for tuning solubility and coordinating ability. |
Authors of publication | Wozniak, Derek I.; Hicks, Andrew J.; Sabbers, William A.; Dobereiner, Graham E. |
Journal of publication | Dalton transactions (Cambridge, England : 2003) |
Year of publication | 2019 |
Journal volume | 48 |
Journal issue | 37 |
Pages of publication | 14138 - 14155 |
a | 22.722 ± 0.002 Å |
b | 18.9379 ± 0.0019 Å |
c | 22.844 ± 0.002 Å |
α | 90° |
β | 105.759 ± 0.002° |
γ | 90° |
Cell volume | 9460.5 ± 1.5 Å3 |
Cell temperature | 100 ± 2 K |
Ambient diffraction temperature | 100.07 K |
Number of distinct elements | 7 |
Space group number | 14 |
Hermann-Mauguin space group symbol | P 1 21/n 1 |
Hall space group symbol | -P 2yn |
Residual factor for all reflections | 0.0905 |
Residual factor for significantly intense reflections | 0.0468 |
Weighted residual factors for significantly intense reflections | 0.1023 |
Weighted residual factors for all reflections included in the refinement | 0.1169 |
Goodness-of-fit parameter for all reflections included in the refinement | 1.004 |
Diffraction radiation wavelength | 0.71073 Å |
Diffraction radiation type | MoKα |