Information card for entry 7701108
Formula | C78 H57 Au B2 F30 N3 O2 P |
Calculated formula | C78 H57 Au B2 F30 N3 O2 P |
Title of publication | Imidazolyl-phenyl (IMP) anions: a modular structure for tuning solubility and coordinating ability. |
Authors of publication | Wozniak, Derek I.; Hicks, Andrew J.; Sabbers, William A.; Dobereiner, Graham E. |
Journal of publication | Dalton transactions (Cambridge, England : 2003) |
Year of publication | 2019 |
Journal volume | 48 |
Journal issue | 37 |
Pages of publication | 14138 - 14155 |
a | 11.4352 ± 0.0019 Å |
b | 20.494 ± 0.003 Å |
c | 17.462 ± 0.003 Å |
α | 90° |
β | 98.794 ± 0.004° |
γ | 90° |
Cell volume | 4044.2 ± 1.1 Å3 |
Cell temperature | 100 ± 2 K |
Ambient diffraction temperature | 100 ± 2 K |
Number of distinct elements | 8 |
Space group number | 4 |
Hermann-Mauguin space group symbol | P 1 21 1 |
Hall space group symbol | P 2yb |
Residual factor for all reflections | 0.0367 |
Residual factor for significantly intense reflections | 0.0295 |
Weighted residual factors for significantly intense reflections | 0.0576 |
Weighted residual factors for all reflections included in the refinement | 0.0592 |
Goodness-of-fit parameter for all reflections included in the refinement | 0.856 |
Diffraction radiation wavelength | 0.71073 Å |
Diffraction radiation type | MoKα |