Information card for entry 7701113
Formula | C3 H15 Bi2 Cl9 N6 O0 |
Calculated formula | C3 H15 Bi2 Cl9 N6 |
Title of publication | Symmetry breaking structural phase transitions, dielectric properties and molecular motions of formamidinium cations in 1D and 2D hybrid compounds: (NH<sub>2</sub>CHNH<sub>2</sub>)<sub>3</sub>[Bi<sub>2</sub>Cl<sub>9</sub>] and (NH<sub>2</sub>CHNH<sub>2</sub>)<sub>3</sub>[Bi<sub>2</sub>Br<sub>9</sub>]. |
Authors of publication | Mencel, K.; Starynowicz, P.; Siczek, M.; Piecha-Bisiorek, A; Jakubas, R.; Medycki, W. |
Journal of publication | Dalton transactions (Cambridge, England : 2003) |
Year of publication | 2019 |
Journal volume | 48 |
Journal issue | 39 |
Pages of publication | 14829 - 14838 |
a | 21.422 ± 0.009 Å |
b | 7.546 ± 0.003 Å |
c | 26.404 ± 0.011 Å |
α | 90° |
β | 90.17 ± 0.03° |
γ | 90° |
Cell volume | 4268 ± 3 Å3 |
Cell temperature | 100 ± 2 K |
Ambient diffraction temperature | 100 ± 2 K |
Number of distinct elements | 6 |
Space group number | 14 |
Hermann-Mauguin space group symbol | P 1 21/c 1 |
Hall space group symbol | -P 2ybc |
Residual factor for all reflections | 0.1059 |
Residual factor for significantly intense reflections | 0.0631 |
Weighted residual factors for significantly intense reflections | 0.1382 |
Weighted residual factors for all reflections included in the refinement | 0.1533 |
Goodness-of-fit parameter for all reflections included in the refinement | 0.949 |
Diffraction radiation wavelength | 0.71073 Å |
Diffraction radiation type | MoKα |