Information card for entry 7701119
Formula | C22 H24 B2 F8 Fe N10 |
Calculated formula | C22 H24 B2 F8 Fe N10 |
Title of publication | Iron(ii) tetrafluoroborate complexes of new tetradentate C-scorpionates as catalysts for the oxidative cleavage of trans-stilbene with H<sub>2</sub>O<sub>2</sub>. |
Authors of publication | Wang, Denan; Gardinier, James R.; Lindeman, Sergey V. |
Journal of publication | Dalton transactions (Cambridge, England : 2003) |
Year of publication | 2019 |
Journal volume | 48 |
Journal issue | 38 |
Pages of publication | 14478 - 14489 |
a | 11.1636 ± 0.0003 Å |
b | 12.0625 ± 0.0003 Å |
c | 12.7027 ± 0.0004 Å |
α | 70.105 ± 0.003° |
β | 83.875 ± 0.002° |
γ | 65.212 ± 0.003° |
Cell volume | 1458.97 ± 0.08 Å3 |
Cell temperature | 250 ± 2 K |
Ambient diffraction temperature | 250 K |
Number of distinct elements | 6 |
Space group number | 2 |
Hermann-Mauguin space group symbol | P -1 |
Hall space group symbol | -P 1 |
Residual factor for all reflections | 0.0377 |
Residual factor for significantly intense reflections | 0.0364 |
Weighted residual factors for significantly intense reflections | 0.102 |
Weighted residual factors for all reflections included in the refinement | 0.1035 |
Goodness-of-fit parameter for all reflections included in the refinement | 1.05 |
Diffraction radiation probe | x-ray |
Diffraction radiation wavelength | 1.54184 Å |
Diffraction radiation type | CuKα |