Information card for entry 7701139
Formula | C20 H15 Br Fe |
Calculated formula | C20 H15 Br Fe |
Title of publication | Ferrocenyl naphthalenes: substituent- and substitution pattern-depending charge transfer studies. |
Authors of publication | Preuß, Andrea; Korb, Marcus; Miesel, Dominique; Rüffer, Tobias; Hildebrandt, Alexander; Lang, Heinrich |
Journal of publication | Dalton transactions (Cambridge, England : 2003) |
Year of publication | 2019 |
Journal volume | 48 |
Journal issue | 38 |
Pages of publication | 14418 - 14432 |
a | 13.8326 ± 0.0007 Å |
b | 11.0072 ± 0.0007 Å |
c | 10.0041 ± 0.0005 Å |
α | 90° |
β | 96.575 ± 0.004° |
γ | 90° |
Cell volume | 1513.19 ± 0.14 Å3 |
Cell temperature | 119 ± 4 K |
Ambient diffraction temperature | 119 ± 4 K |
Number of distinct elements | 4 |
Space group number | 14 |
Hermann-Mauguin space group symbol | P 1 21/c 1 |
Hall space group symbol | -P 2ybc |
Residual factor for all reflections | 0.0502 |
Residual factor for significantly intense reflections | 0.0407 |
Weighted residual factors for significantly intense reflections | 0.105 |
Weighted residual factors for all reflections included in the refinement | 0.1163 |
Goodness-of-fit parameter for all reflections included in the refinement | 1.055 |
Diffraction radiation wavelength | 1.54184 Å |
Diffraction radiation type | CuKα |