Information card for entry 7701141
Formula | C30 H24 Fe2 |
Calculated formula | C30 H24 Fe2 |
Title of publication | Ferrocenyl naphthalenes: substituent- and substitution pattern-depending charge transfer studies. |
Authors of publication | Preuß, Andrea; Korb, Marcus; Miesel, Dominique; Rüffer, Tobias; Hildebrandt, Alexander; Lang, Heinrich |
Journal of publication | Dalton transactions (Cambridge, England : 2003) |
Year of publication | 2019 |
Journal volume | 48 |
Journal issue | 38 |
Pages of publication | 14418 - 14432 |
a | 17.0392 ± 0.0007 Å |
b | 10.0481 ± 0.0005 Å |
c | 12.2011 ± 0.0005 Å |
α | 90° |
β | 92.02 ± 0.003° |
γ | 90° |
Cell volume | 2087.67 ± 0.16 Å3 |
Cell temperature | 125 ± 0.1 K |
Ambient diffraction temperature | 125 ± 0.1 K |
Number of distinct elements | 3 |
Space group number | 14 |
Hermann-Mauguin space group symbol | P 1 21/c 1 |
Hall space group symbol | -P 2ybc |
Residual factor for all reflections | 0.031 |
Residual factor for significantly intense reflections | 0.0259 |
Weighted residual factors for significantly intense reflections | 0.0598 |
Weighted residual factors for all reflections included in the refinement | 0.0619 |
Goodness-of-fit parameter for all reflections included in the refinement | 1.028 |
Diffraction radiation wavelength | 0.71073 Å |
Diffraction radiation type | MoKα |