Information card for entry 7701144
Formula | C8 H10 Co K N10 |
Calculated formula | C8 Co K N9.9996 |
Title of publication | Phase transition in the extreme: a cubic-to-triclinic symmetry change in dielectrically switchable cyanide perovskites. |
Authors of publication | Trzebiatowska, Monika; Gągor, Anna; Macalik, Lucyna; Peksa, Paulina; Sieradzki, Adam |
Journal of publication | Dalton transactions (Cambridge, England : 2003) |
Year of publication | 2019 |
Journal volume | 48 |
Journal issue | 42 |
Pages of publication | 15830 - 15840 |
a | 11.6057 ± 0.0004 Å |
b | 11.6057 ± 0.0004 Å |
c | 11.6057 ± 0.0004 Å |
α | 90° |
β | 90° |
γ | 90° |
Cell volume | 1563.2 ± 0.09 Å3 |
Cell temperature | 330.03 ± 0.16 K |
Ambient diffraction temperature | 330.03 ± 0.16 K |
Number of distinct elements | 5 |
Space group number | 225 |
Hermann-Mauguin space group symbol | F m -3 m |
Hall space group symbol | -F 4 2 3 |
Residual factor for all reflections | 0.0376 |
Residual factor for significantly intense reflections | 0.0326 |
Weighted residual factors for significantly intense reflections | 0.0871 |
Weighted residual factors for all reflections included in the refinement | 0.0912 |
Goodness-of-fit parameter for all reflections included in the refinement | 0.786 |
Diffraction radiation probe | x-ray |
Diffraction radiation wavelength | 0.71073 Å |
Diffraction radiation type | MoKα |