Information card for entry 7701161
Formula | C32 H31 B |
Calculated formula | C32 H31 B |
Title of publication | Synthesis, structure and anion binding properties of 1,8-bis(dimesitylboryl)anthracene and its monoborylated analog. |
Authors of publication | Teerasarunyanon, Ratanakorn; Wilkins, Lewis C.; Park, Gyeongjin; Gabbaï, François P |
Journal of publication | Dalton transactions (Cambridge, England : 2003) |
Year of publication | 2019 |
Journal volume | 48 |
Journal issue | 39 |
Pages of publication | 14777 - 14782 |
a | 40.663 ± 0.005 Å |
b | 8.0101 ± 0.0009 Å |
c | 15.645 ± 0.002 Å |
α | 90° |
β | 93.812 ± 0.004° |
γ | 90° |
Cell volume | 5084.5 ± 1.1 Å3 |
Cell temperature | 110 ± 2 K |
Ambient diffraction temperature | 109.99 K |
Number of distinct elements | 3 |
Space group number | 15 |
Hermann-Mauguin space group symbol | C 1 2/c 1 |
Hall space group symbol | -C 2yc |
Residual factor for all reflections | 0.1254 |
Residual factor for significantly intense reflections | 0.0959 |
Weighted residual factors for significantly intense reflections | 0.2189 |
Weighted residual factors for all reflections included in the refinement | 0.233 |
Goodness-of-fit parameter for all reflections included in the refinement | 1.214 |
Diffraction radiation wavelength | 0.71073 Å |
Diffraction radiation type | MoKα |