Information card for entry 7701173
Formula | C40 H62 Cl3 N2 Ti |
Calculated formula | C40 H62 Cl3 N2 Ti |
Title of publication | Synthesis, structure and DFT calculations of mononuclear cyclic (alkyl)(amino) carbene supported titanium(ii) complexes. |
Authors of publication | Ma, Wangyang; Zhang, Jing-Xuan; Lin, Zhenyang; Tilley, T. Don; Ye, Qing |
Journal of publication | Dalton transactions (Cambridge, England : 2003) |
Year of publication | 2019 |
Journal volume | 48 |
Journal issue | 40 |
Pages of publication | 14962 - 14965 |
a | 20.5112 ± 0.0008 Å |
b | 11.5599 ± 0.0004 Å |
c | 17.7631 ± 0.0006 Å |
α | 90° |
β | 108.197 ± 0.001° |
γ | 90° |
Cell volume | 4001.1 ± 0.2 Å3 |
Cell temperature | 100 ± 2 K |
Ambient diffraction temperature | 100.01 K |
Number of distinct elements | 5 |
Space group number | 14 |
Hermann-Mauguin space group symbol | P 1 21/c 1 |
Hall space group symbol | -P 2ybc |
Residual factor for all reflections | 0.0687 |
Residual factor for significantly intense reflections | 0.0436 |
Weighted residual factors for significantly intense reflections | 0.0877 |
Weighted residual factors for all reflections included in the refinement | 0.0989 |
Goodness-of-fit parameter for all reflections included in the refinement | 1.03 |
Diffraction radiation wavelength | 0.71073 Å |
Diffraction radiation type | MoKα |