Information card for entry 7701175
Common name | [CuL30aBr] |
Formula | C26 H30 Br2 Cu2 N4 O6 |
Calculated formula | C26 H30 Br2 Cu2 N4 O6 |
Title of publication | Copper(ii) complexes with tridentate Schiff base-like ligands: solid state and solution structures and anticancer activity. |
Authors of publication | Dankhoff, Katja; Gold, Madeleine; Kober, Luisa; Schmitt, Florian; Pfeifer, Lena; Dürrmann, Andreas; Kostrhunova, Hana; Rothemund, Matthias; Brabec, Viktor; Schobert, Rainer; Weber, Birgit |
Journal of publication | Dalton transactions (Cambridge, England : 2003) |
Year of publication | 2019 |
Journal volume | 48 |
Journal issue | 40 |
Pages of publication | 15220 - 15230 |
a | 7.7302 ± 0.0004 Å |
b | 9.2879 ± 0.0005 Å |
c | 10.2517 ± 0.0005 Å |
α | 94.782 ± 0.004° |
β | 94.31 ± 0.004° |
γ | 108.849 ± 0.004° |
Cell volume | 690.07 ± 0.06 Å3 |
Cell temperature | 133 ± 2 K |
Ambient diffraction temperature | 133 ± 2 K |
Number of distinct elements | 6 |
Space group number | 2 |
Hermann-Mauguin space group symbol | P -1 |
Hall space group symbol | -P 1 |
Residual factor for all reflections | 0.0361 |
Residual factor for significantly intense reflections | 0.0266 |
Weighted residual factors for significantly intense reflections | 0.0628 |
Weighted residual factors for all reflections included in the refinement | 0.0658 |
Goodness-of-fit parameter for all reflections included in the refinement | 0.985 |
Diffraction radiation wavelength | 0.71073 Å |
Diffraction radiation type | MoKα |