Information card for entry 7701192
Formula | C34 H33 Cl F5 N3 O4 Pt S |
Calculated formula | C34 H33 Cl F5 N3 O4 Pt S |
Title of publication | Selective synthesis, reactivity and luminescence of unsymmetrical bis-cyclometalated Pt(iv) complexes. |
Authors of publication | Vivancos, Ángela; Poveda, Dionisio; Muñoz, Alonso; Moreno, Julia; Bautista, Delia; González-Herrero, Pablo |
Journal of publication | Dalton transactions (Cambridge, England : 2003) |
Year of publication | 2019 |
Journal volume | 48 |
Journal issue | 38 |
Pages of publication | 14367 - 14382 |
a | 10.6722 ± 0.0014 Å |
b | 13.0588 ± 0.0017 Å |
c | 13.3512 ± 0.0016 Å |
α | 74.425 ± 0.004° |
β | 89.412 ± 0.004° |
γ | 69.723 ± 0.004° |
Cell volume | 1674.2 ± 0.4 Å3 |
Cell temperature | 100 ± 2 K |
Ambient diffraction temperature | 100 ± 2 K |
Number of distinct elements | 8 |
Space group number | 2 |
Hermann-Mauguin space group symbol | P -1 |
Hall space group symbol | -P 1 |
Residual factor for all reflections | 0.0241 |
Residual factor for significantly intense reflections | 0.0209 |
Weighted residual factors for significantly intense reflections | 0.0487 |
Weighted residual factors for all reflections included in the refinement | 0.0498 |
Goodness-of-fit parameter for all reflections included in the refinement | 1.057 |
Diffraction radiation wavelength | 0.71073 Å |
Diffraction radiation type | MoKα |