Information card for entry 7701206
Formula | C22 H25 P Sn |
Calculated formula | C22 H25 P Sn |
Title of publication | Bi- and tridentate stannylphosphines and their coordination to low-valent platinum. |
Authors of publication | Salazar-Díaz, J Jacobo; Muñoz-Hernández, Miguel A; Rufino-Felipe, Ernesto; Flores-Alamo, Marcos; Ramírez-Solís, Alejandro; Montiel-Palma, Virginia |
Journal of publication | Dalton transactions (Cambridge, England : 2003) |
Year of publication | 2019 |
Journal volume | 48 |
Journal issue | 42 |
Pages of publication | 15896 - 15905 |
a | 10.7778 ± 0.0003 Å |
b | 10.9555 ± 0.0003 Å |
c | 19.6759 ± 0.0004 Å |
α | 77.307 ± 0.002° |
β | 85.848 ± 0.002° |
γ | 62.788 ± 0.002° |
Cell volume | 2014.57 ± 0.1 Å3 |
Cell temperature | 100 ± 0.3 K |
Ambient diffraction temperature | 100 ± 0.3 K |
Number of distinct elements | 4 |
Space group number | 2 |
Hermann-Mauguin space group symbol | P -1 |
Hall space group symbol | -P 1 |
Residual factor for all reflections | 0.0314 |
Residual factor for significantly intense reflections | 0.0255 |
Weighted residual factors for significantly intense reflections | 0.0531 |
Weighted residual factors for all reflections included in the refinement | 0.0558 |
Goodness-of-fit parameter for all reflections included in the refinement | 1.026 |
Diffraction radiation probe | x-ray |
Diffraction radiation wavelength | 0.71073 Å |
Diffraction radiation type | MoKα |