Information card for entry 7701217
Formula | C32 H34 I2 N4 O4 |
Calculated formula | C32 H34 I2 N4 O4 |
Title of publication | Cyclotriveratrylene-tethered trinuclear palladium(ii)-NHC complexes; reversal of site selectivity in Suzuki-Miyaura reactions. |
Authors of publication | Fowler, Jonathan M.; Britton, Edward; Pask, Christopher M.; Willans, Charlotte E.; Hardie, Michaele J. |
Journal of publication | Dalton transactions (Cambridge, England : 2003) |
Year of publication | 2019 |
Journal volume | 48 |
Journal issue | 39 |
Pages of publication | 14687 - 14695 |
a | 9.8101 ± 0.0001 Å |
b | 11.6994 ± 0.0001 Å |
c | 14.6364 ± 0.0001 Å |
α | 83.317 ± 0.001° |
β | 83.019 ± 0.001° |
γ | 74.051 ± 0.001° |
Cell volume | 1597.14 ± 0.03 Å3 |
Cell temperature | 100 ± 2 K |
Ambient diffraction temperature | 100 ± 2 K |
Number of distinct elements | 5 |
Space group number | 2 |
Hermann-Mauguin space group symbol | P -1 |
Hall space group symbol | -P 1 |
Residual factor for all reflections | 0.0314 |
Residual factor for significantly intense reflections | 0.0295 |
Weighted residual factors for significantly intense reflections | 0.0843 |
Weighted residual factors for all reflections included in the refinement | 0.0861 |
Goodness-of-fit parameter for all reflections included in the refinement | 1.056 |
Diffraction radiation wavelength | 0.6889 Å |
Diffraction radiation type | synchrotron |