Information card for entry 7701226
Chemical name | (3,3??,5,5??-Tetramethoxycarbonyl-1,1?:3?,1??-terphen-2?-yl)diphenylphosphane oxide |
Formula | C38 H31 O9 P |
Calculated formula | C38 H31 O9 P |
Title of publication | A new set of metal-organic frameworks synthesised from diisophthalate-based, 2'-phosphorus-substituted m-terphenyl linker molecules. |
Authors of publication | Stein, Timo; Hoffmann, Frank; Fröba, Michael |
Journal of publication | Dalton transactions (Cambridge, England : 2003) |
Year of publication | 2019 |
Journal volume | 48 |
Journal issue | 40 |
Pages of publication | 15127 - 15135 |
a | 8.2514 ± 0.0004 Å |
b | 11.6965 ± 0.0005 Å |
c | 17.6863 ± 0.0006 Å |
α | 101.701 ± 0.003° |
β | 97.017 ± 0.003° |
γ | 102.97 ± 0.004° |
Cell volume | 1603.49 ± 0.12 Å3 |
Cell temperature | 100 ± 2 K |
Ambient diffraction temperature | 100 ± 2 K |
Number of distinct elements | 4 |
Space group number | 2 |
Hermann-Mauguin space group symbol | P -1 |
Hall space group symbol | -P 1 |
Residual factor for all reflections | 0.051 |
Residual factor for significantly intense reflections | 0.045 |
Weighted residual factors for significantly intense reflections | 0.1206 |
Weighted residual factors for all reflections included in the refinement | 0.1275 |
Goodness-of-fit parameter for all reflections included in the refinement | 1.033 |
Diffraction radiation probe | x-ray |
Diffraction radiation wavelength | 1.54184 Å |
Diffraction radiation type | CuKα |