Information card for entry 7701261
Formula | C10 H10 N20 O4 Zn3 |
Calculated formula | C10 H8 N20 O4 Zn3 |
Title of publication | Surfactant-assisted assembly of nanoscale zinc coordination compounds to enhance tandem conversion reactions in water. |
Authors of publication | Huang, Chao; Zhu, Kaifang; Zhang, Yingying; Lu, Guizhen; Shao, Zhichao; Gao, Kuan; Mi, Liwei; Hou, Hongwei |
Journal of publication | Dalton transactions (Cambridge, England : 2003) |
Year of publication | 2019 |
Journal volume | 48 |
Journal issue | 42 |
Pages of publication | 16008 - 16016 |
a | 20.348 ± 0.004 Å |
b | 12.59 ± 0.003 Å |
c | 19.354 ± 0.004 Å |
α | 90° |
β | 117.33 ± 0.03° |
γ | 90° |
Cell volume | 4405 ± 2 Å3 |
Cell temperature | 293 ± 2 K |
Ambient diffraction temperature | 293 ± 2 K |
Number of distinct elements | 5 |
Space group number | 15 |
Hermann-Mauguin space group symbol | C 1 2/c 1 |
Hall space group symbol | -C 2yc |
Residual factor for all reflections | 0.0597 |
Residual factor for significantly intense reflections | 0.0495 |
Weighted residual factors for significantly intense reflections | 0.0912 |
Weighted residual factors for all reflections included in the refinement | 0.0964 |
Goodness-of-fit parameter for all reflections included in the refinement | 1.138 |
Diffraction radiation wavelength | 0.71073 Å |
Diffraction radiation type | MoKα |