Information card for entry 7701271
Formula | C7 H10 Au Br2 N O2 S2 |
Calculated formula | C7 H10 Au Br2 N O2 S2 |
Title of publication | Au(iii)-Proline derivatives exhibiting selective antiproliferative activity against HepG2/SB3 apoptosis-resistant cancer cells. |
Authors of publication | Brustolin, L.; Pettenuzzo, N.; Nardon, C.; Quarta, S.; Marchiò, L; Biondi, B.; Pontisso, P.; Fregona, D. |
Journal of publication | Dalton transactions (Cambridge, England : 2003) |
Year of publication | 2019 |
Journal volume | 48 |
Journal issue | 42 |
Pages of publication | 16017 - 16025 |
a | 7.197 ± 0.002 Å |
b | 14.315 ± 0.003 Å |
c | 26.37 ± 0.005 Å |
α | 90° |
β | 90° |
γ | 90° |
Cell volume | 2716.8 ± 1.1 Å3 |
Cell temperature | 293 ± 2 K |
Ambient diffraction temperature | 293 ± 2 K |
Number of distinct elements | 7 |
Space group number | 19 |
Hermann-Mauguin space group symbol | P 21 21 21 |
Hall space group symbol | P 2ac 2ab |
Residual factor for all reflections | 0.0461 |
Residual factor for significantly intense reflections | 0.0369 |
Weighted residual factors for significantly intense reflections | 0.0783 |
Weighted residual factors for all reflections included in the refinement | 0.0844 |
Goodness-of-fit parameter for all reflections included in the refinement | 1.009 |
Diffraction radiation wavelength | 0.71073 Å |
Diffraction radiation type | MoKα |