Information card for entry 7701273
Formula |
C36 H59 Cd Ge2 I2 N4 |
Calculated formula |
C36 H60 Cd Ge2 I2 N4 |
Title of publication |
Germylene Stabilized Group 12 Metal Complexes and their Reactivity with Chalcogens |
Authors of publication |
Selvarajan, Nagendran; Sinhababu, Soumen; Sharma, Mahendra Kumar; Mahawar, Pritam; Kaur, Supreet; Singh, Vivek Kumar; Paliwal, Akhil; Yadav, Dhirendra; Kashyap, Hemant K. |
Journal of publication |
Dalton Transactions |
Year of publication |
2019 |
a |
17.8395 ± 0.0018 Å |
b |
19.3485 ± 0.0019 Å |
c |
24.563 ± 0.002 Å |
α |
90° |
β |
90° |
γ |
90° |
Cell volume |
8478.4 ± 1.4 Å3 |
Cell temperature |
150 ± 2 K |
Ambient diffraction temperature |
150 ± 2 K |
Number of distinct elements |
6 |
Space group number |
61 |
Hermann-Mauguin space group symbol |
P b c a |
Hall space group symbol |
-P 2ac 2ab |
Residual factor for all reflections |
0.0755 |
Residual factor for significantly intense reflections |
0.0544 |
Weighted residual factors for significantly intense reflections |
0.1411 |
Weighted residual factors for all reflections included in the refinement |
0.153 |
Goodness-of-fit parameter for all reflections included in the refinement |
1.033 |
Diffraction radiation wavelength |
0.71073 Å |
Diffraction radiation type |
MoKα |
Yes |
No |
No |