Information card for entry 7701509
Formula | C26 H25 Cl Cu N6 O |
Calculated formula | C26 H25 Cl Cu N6 O |
Title of publication | Novel latonduine derived proligands and their copper(ii) complexes show cytotoxicity in the nanomolar range in human colon adenocarcinoma cells and in vitro cancer selectivity. |
Authors of publication | Bacher, Felix; Wittmann, Christopher; Nové, Márta; Spengler, Gabriella; Marć, Małgorzata A; Enyedy, Eva A.; Darvasiová, Denisa; Rapta, Peter; Reiner, Thomas; Arion, Vladimir B. |
Journal of publication | Dalton transactions (Cambridge, England : 2003) |
Year of publication | 2019 |
Journal volume | 48 |
Journal issue | 28 |
Pages of publication | 10464 - 10478 |
a | 10.3347 ± 0.0004 Å |
b | 23.4454 ± 0.0007 Å |
c | 11.0757 ± 0.0004 Å |
α | 90° |
β | 117.731 ± 0.0012° |
γ | 90° |
Cell volume | 2375.41 ± 0.15 Å3 |
Cell temperature | 100 ± 2 K |
Ambient diffraction temperature | 100 ± 2 K |
Number of distinct elements | 6 |
Space group number | 14 |
Hermann-Mauguin space group symbol | P 1 21/c 1 |
Hall space group symbol | -P 2ybc |
Residual factor for all reflections | 0.1187 |
Residual factor for significantly intense reflections | 0.0566 |
Weighted residual factors for significantly intense reflections | 0.1204 |
Weighted residual factors for all reflections included in the refinement | 0.1597 |
Goodness-of-fit parameter for all reflections included in the refinement | 1.031 |
Diffraction radiation wavelength | 0.71073 Å |
Diffraction radiation type | MoKα |