Information card for entry 7701533
Formula | C44 H56 Cl2 N16 Ni2 O18 |
Calculated formula | C44 H56 Cl2 N16 Ni2 O18 |
Title of publication | Structural and magnetic characterization of Ni(ii), Co(ii), and Fe(ii) binuclear complexes on a bis(pyridyl-triazolyl)alkane basis. |
Authors of publication | Gusev, Alexey; Nemec, Ivan; Herchel, Radovan; Riush, Irina; Titiš, Ján; Boča, Roman; Lyssenko, Konstantin; Kiskin, Mikhail; Eremenko, Igor; Linert, Wolfgang |
Journal of publication | Dalton transactions (Cambridge, England : 2003) |
Year of publication | 2019 |
Journal volume | 48 |
Journal issue | 28 |
Pages of publication | 10526 - 10536 |
a | 14.649 ± 0.005 Å |
b | 12.745 ± 0.005 Å |
c | 17.96 ± 0.004 Å |
α | 90° |
β | 125.061 ± 0.018° |
γ | 90° |
Cell volume | 2744.7 ± 1.7 Å3 |
Cell temperature | 150 ± 2 K |
Ambient diffraction temperature | 150 ± 2 K |
Number of distinct elements | 6 |
Space group number | 14 |
Hermann-Mauguin space group symbol | P 1 21/c 1 |
Hall space group symbol | -P 2ybc |
Residual factor for all reflections | 0.0705 |
Residual factor for significantly intense reflections | 0.0474 |
Weighted residual factors for significantly intense reflections | 0.1225 |
Weighted residual factors for all reflections included in the refinement | 0.1321 |
Goodness-of-fit parameter for all reflections included in the refinement | 0.949 |
Diffraction radiation wavelength | 0.71073 Å |
Diffraction radiation type | MoKα |