Information card for entry 7701558
Formula | C16 H46 Mg N2 O2 Si4 |
Calculated formula | C16 H46 Mg N2 O2 Si4 |
Title of publication | Bis(trimethylsilyl)amide complexes of s-block metals with bidentate ether and amine ligands. |
Authors of publication | Schüler, Philipp; Görls, Helmar; Westerhausen, Matthias; Krieck, Sven |
Journal of publication | Dalton transactions (Cambridge, England : 2003) |
Year of publication | 2019 |
Journal volume | 48 |
Journal issue | 24 |
Pages of publication | 8966 - 8975 |
a | 8.3703 ± 0.0002 Å |
b | 34.2576 ± 0.0007 Å |
c | 19.6484 ± 0.0004 Å |
α | 90° |
β | 100.452 ± 0.001° |
γ | 90° |
Cell volume | 5540.6 ± 0.2 Å3 |
Cell temperature | 133 ± 2 K |
Ambient diffraction temperature | 133 ± 2 K |
Number of distinct elements | 6 |
Space group number | 14 |
Hermann-Mauguin space group symbol | P 1 21/c 1 |
Hall space group symbol | -P 2ybc |
Residual factor for all reflections | 0.0641 |
Residual factor for significantly intense reflections | 0.0474 |
Weighted residual factors for significantly intense reflections | 0.0966 |
Weighted residual factors for all reflections included in the refinement | 0.1042 |
Goodness-of-fit parameter for all reflections included in the refinement | 1.1 |
Diffraction radiation wavelength | 0.71073 Å |
Diffraction radiation type | MoKα |