Information card for entry 7701566
Chemical name | (2?-(2??-oxyphenyl)-benzoxazolato)-9-borafluorene |
Formula | C25 H16 B N O2 |
Calculated formula | C25 H16 B N O2 |
Title of publication | The effect of locking π-conjugation in organoboron moieties in the structures of luminescent tetracoordinate boron complexes. |
Authors of publication | Urban, Mateusz; Durka, Krzysztof; Górka, Patrycja; Wiosna-Sałyga, Gabriela; Nawara, Krzysztof; Jankowski, Piotr; Luliński, Sergiusz |
Journal of publication | Dalton transactions (Cambridge, England : 2003) |
Year of publication | 2019 |
Journal volume | 48 |
Journal issue | 24 |
Pages of publication | 8642 - 8663 |
a | 12.2286 ± 0.0002 Å |
b | 9.9535 ± 0.0002 Å |
c | 15.696 ± 0.0003 Å |
α | 90° |
β | 104.304 ± 0.002° |
γ | 90° |
Cell volume | 1851.25 ± 0.06 Å3 |
Cell temperature | 100 ± 2 K |
Ambient diffraction temperature | 100 ± 2 K |
Number of distinct elements | 5 |
Space group number | 14 |
Hermann-Mauguin space group symbol | P 1 21/c 1 |
Hall space group symbol | -P 2ybc |
Residual factor for all reflections | 0.0434 |
Residual factor for significantly intense reflections | 0.0381 |
Weighted residual factors for significantly intense reflections | 0.093 |
Weighted residual factors for all reflections included in the refinement | 0.0983 |
Goodness-of-fit parameter for all reflections included in the refinement | 1.065 |
Diffraction radiation probe | x-ray |
Diffraction radiation wavelength | 1.54184 Å |
Diffraction radiation type | CuKα |