Information card for entry 7701577
Formula | C80 H96 Dy2 N6 O22 Zn2 |
Calculated formula | C80 H96 Dy2 N6 O22 Zn2 |
Title of publication | Effect of coordination anion substitutions on relaxation dynamics of defect dicubane Zn<sub>2</sub>Dy<sub>2</sub> tetranuclear clusters. |
Authors of publication | Ke, Hongshan; Wei, Wen; Yang, Yongsheng; Zhang, Jun; Zhang, Yi-Quan; Xie, Gang; Chen, Sanping |
Journal of publication | Dalton transactions (Cambridge, England : 2003) |
Year of publication | 2019 |
Journal volume | 48 |
Journal issue | 22 |
Pages of publication | 7844 - 7852 |
a | 13.7944 ± 0.0017 Å |
b | 14.3871 ± 0.0018 Å |
c | 20.258 ± 0.003 Å |
α | 90° |
β | 91.245 ± 0.003° |
γ | 90° |
Cell volume | 4019.5 ± 0.9 Å3 |
Cell temperature | 173 ± 2 K |
Ambient diffraction temperature | 173 ± 2 K |
Number of distinct elements | 6 |
Space group number | 14 |
Hermann-Mauguin space group symbol | P 1 21/n 1 |
Hall space group symbol | -P 2yn |
Residual factor for all reflections | 0.0784 |
Residual factor for significantly intense reflections | 0.052 |
Weighted residual factors for significantly intense reflections | 0.1254 |
Weighted residual factors for all reflections included in the refinement | 0.143 |
Goodness-of-fit parameter for all reflections included in the refinement | 0.999 |
Diffraction radiation wavelength | 0.71073 Å |
Diffraction radiation type | MoKα |