Information card for entry 7701582
Formula | Ga41 Mo8 |
Calculated formula | Ga41 Mo8 |
Title of publication | From endohedral cluster superconductors to approximant phases: synthesis, crystal and electronic structure, and physical properties of Mo<sub>8</sub>Ga<sub>41-x</sub>Zn<sub>x</sub> and Mo<sub>7</sub>Ga<sub>52-x</sub>Zn<sub>x</sub>. |
Authors of publication | Verchenko, Valeriy Yu; Zubtsovskii, Alexander O.; Wei, Zheng; Tsirlin, Alexander A.; Dikarev, Evgeny V.; Shevelkov, Andrei V. |
Journal of publication | Dalton transactions (Cambridge, England : 2003) |
Year of publication | 2019 |
Journal volume | 48 |
Journal issue | 22 |
Pages of publication | 7853 - 7861 |
a | 14.01884 ± 0.00007 Å |
b | 14.01884 ± 0.00007 Å |
c | 15.05418 ± 0.00009 Å |
α | 90° |
β | 90° |
γ | 120° |
Cell volume | 2562.19 ± 0.02 Å3 |
Cell temperature | 300 K |
Ambient diffraction temperature | 300 K |
Number of distinct elements | 2 |
Space group number | 148 |
Hermann-Mauguin space group symbol | R -3 :H |
Hall space group symbol | -R 3 |
Residual factor for all reflections | 0.0267 |
Residual factor for significantly intense reflections | 0.0267 |
Weighted residual factors for all reflections | 0.0372 |
Weighted residual factors for significantly intense reflections | 0.0372 |
Goodness-of-fit parameter for all reflections | 1.71 |
Method of determination | powder diffraction |
Diffraction radiation probe | x-ray |
Diffraction radiation wavelength | 1.5406 Å |
Diffraction radiation type | CuKα1 |