Information card for entry 7701585
Formula | H La2 O6 Ta |
Calculated formula | H La2 O6 Ta |
Title of publication | Hydrothermal synthesis and structural characterization of several complex rare earth tantalates: Ln<sub>2</sub>TaO<sub>5</sub>(OH) (Ln = La, Pr) and Ln<sub>3</sub>Ta<sub>2</sub>O<sub>9</sub>(OH) (Ln = Pr, Nd). |
Authors of publication | Sanjeewa, Liurukara D.; Fulle, Kyle; McMillen, Colin D.; Kolis, Joseph W. |
Journal of publication | Dalton transactions (Cambridge, England : 2003) |
Year of publication | 2019 |
Journal volume | 48 |
Journal issue | 22 |
Pages of publication | 7704 - 7713 |
a | 7.0897 ± 0.0003 Å |
b | 6.7199 ± 0.0004 Å |
c | 10.2645 ± 0.0005 Å |
α | 90° |
β | 94.158 ± 0.002° |
γ | 90° |
Cell volume | 487.73 ± 0.04 Å3 |
Cell temperature | 298 ± 2 K |
Ambient diffraction temperature | 298 ± 2 K |
Number of distinct elements | 4 |
Space group number | 14 |
Hermann-Mauguin space group symbol | P 1 21/n 1 |
Hall space group symbol | -P 2yn |
Residual factor for all reflections | 0.0181 |
Residual factor for significantly intense reflections | 0.0166 |
Weighted residual factors for significantly intense reflections | 0.0365 |
Weighted residual factors for all reflections included in the refinement | 0.037 |
Goodness-of-fit parameter for all reflections included in the refinement | 1.18 |
Diffraction radiation wavelength | 0.71073 Å |
Diffraction radiation type | MoKα |