Information card for entry 7701610
Formula | C9 H9 Mn N O7 |
Calculated formula | C9 H9 Mn N O7 |
Title of publication | Structural variation of transition metal-organic frameworks using deep eutectic solvents with different hydrogen bond donors. |
Authors of publication | Zhao, Ming-Yu; Zhu, Jian-Nan; Li, Peng; Li, Wei; Cai, Ting; Cheng, Fang-Fang; Xiong, Wei-Wei |
Journal of publication | Dalton transactions (Cambridge, England : 2003) |
Year of publication | 2019 |
Journal volume | 48 |
Journal issue | 27 |
Pages of publication | 10199 - 10209 |
a | 7.0734 ± 0.0005 Å |
b | 9.6325 ± 0.0007 Å |
c | 15.3798 ± 0.0011 Å |
α | 90° |
β | 94.408 ± 0.002° |
γ | 90° |
Cell volume | 1044.8 ± 0.13 Å3 |
Cell temperature | 293 ± 2 K |
Ambient diffraction temperature | 293 ± 2 K |
Number of distinct elements | 5 |
Space group number | 14 |
Hermann-Mauguin space group symbol | P 1 21/n 1 |
Hall space group symbol | -P 2yn |
Residual factor for all reflections | 0.0324 |
Residual factor for significantly intense reflections | 0.0251 |
Weighted residual factors for significantly intense reflections | 0.0641 |
Weighted residual factors for all reflections included in the refinement | 0.068 |
Goodness-of-fit parameter for all reflections included in the refinement | 1.017 |
Diffraction radiation wavelength | 0.71073 Å |
Diffraction radiation type | MoKα |