Information card for entry 7701627
Chemical name | Gallium(III) methylxanthate |
Formula | C6 H9 Ga O3 S6 |
Calculated formula | C6 H9 Ga O3 S6 |
Title of publication | Accessing γ-Ga<sub>2</sub>S<sub>3</sub> by solventless thermolysis of gallium xanthates: a low-temperature limit for crystalline products. |
Authors of publication | Alderhami, Suliman A.; Collison, David; Lewis, David J.; McNaughter, Paul D.; O'Brien, Paul; Spencer, Ben F.; Vitorica-Yrezabal, Inigo; Whitehead, George |
Journal of publication | Dalton transactions (Cambridge, England : 2003) |
Year of publication | 2019 |
Journal volume | 48 |
Journal issue | 41 |
Pages of publication | 15605 - 15612 |
a | 9.5526 ± 0.0002 Å |
b | 13.9797 ± 0.0003 Å |
c | 11.1352 ± 0.0003 Å |
α | 90° |
β | 107.382 ± 0.003° |
γ | 90° |
Cell volume | 1419.12 ± 0.06 Å3 |
Cell temperature | 149.99 ± 0.1 K |
Ambient diffraction temperature | 149.99 ± 0.1 K |
Number of distinct elements | 5 |
Space group number | 14 |
Hermann-Mauguin space group symbol | P 1 21/n 1 |
Hall space group symbol | -P 2yn |
Residual factor for all reflections | 0.0182 |
Residual factor for significantly intense reflections | 0.0167 |
Weighted residual factors for significantly intense reflections | 0.0357 |
Weighted residual factors for all reflections included in the refinement | 0.0362 |
Goodness-of-fit parameter for all reflections included in the refinement | 1.096 |
Diffraction radiation probe | x-ray |
Diffraction radiation wavelength | 0.71073 Å |
Diffraction radiation type | MoKα |