Information card for entry 7701632
Formula | C58 H68 Au2 Cl2 Cu F6 N6 O4 P3 |
Calculated formula | C58 H68 Au2 Cl2 Cu F6 N6 O4 P3 |
Title of publication | Phosphine-substituted 1,2,3-triazoles as P,C- and P,N-ligands for photoluminescent coinage metal complexes. |
Authors of publication | Seifert, Tim P.; Bestgen, Sebastian; Feuerstein, Thomas J.; Lebedkin, Sergei; Krämer, Felix; Fengler, Christian; Gamer, Michael T.; Kappes, Manfred M.; Roesky, Peter W. |
Journal of publication | Dalton transactions (Cambridge, England : 2003) |
Year of publication | 2019 |
Journal volume | 48 |
Journal issue | 41 |
Pages of publication | 15427 - 15434 |
a | 10.3665 ± 0.0004 Å |
b | 27.9101 ± 0.0011 Å |
c | 21.4135 ± 0.0007 Å |
α | 90° |
β | 92.509 ± 0.003° |
γ | 90° |
Cell volume | 6189.6 ± 0.4 Å3 |
Cell temperature | 100 K |
Ambient diffraction temperature | 100 K |
Number of distinct elements | 9 |
Space group number | 14 |
Hermann-Mauguin space group symbol | P 1 21/n 1 |
Hall space group symbol | -P 2yn |
Residual factor for all reflections | 0.1263 |
Residual factor for significantly intense reflections | 0.0831 |
Weighted residual factors for significantly intense reflections | 0.2095 |
Weighted residual factors for all reflections included in the refinement | 0.2401 |
Goodness-of-fit parameter for all reflections included in the refinement | 1.134 |
Diffraction radiation wavelength | 0.71073 Å |
Diffraction radiation type | MoKα |