Information card for entry 7701638
Formula | C14 H30 Cl4 Mn N4 O4 |
Calculated formula | C14 H30 Cl4 Mn N4 O4 |
Title of publication | Investigation of the magnetic anisotropy in a series of trigonal bipyramidal Mn(ii) complexes. |
Authors of publication | Hay, Moya A.; Sarkar, Arup; Marriott, Katie E. R.; Wilson, Claire; Rajaraman, Gopalan; Murrie, Mark |
Journal of publication | Dalton transactions (Cambridge, England : 2003) |
Year of publication | 2019 |
Journal volume | 48 |
Journal issue | 41 |
Pages of publication | 15480 - 15486 |
a | 12.568 ± 0.002 Å |
b | 12.844 ± 0.002 Å |
c | 13.236 ± 0.002 Å |
α | 90° |
β | 90° |
γ | 90° |
Cell volume | 2136.6 ± 0.6 Å3 |
Cell temperature | 100 ± 2 K |
Ambient diffraction temperature | 100 ± 2 K |
Number of distinct elements | 6 |
Space group number | 29 |
Hermann-Mauguin space group symbol | P c a 21 |
Hall space group symbol | P 2c -2ac |
Residual factor for all reflections | 0.0731 |
Residual factor for significantly intense reflections | 0.0531 |
Weighted residual factors for significantly intense reflections | 0.0976 |
Weighted residual factors for all reflections included in the refinement | 0.1044 |
Goodness-of-fit parameter for all reflections included in the refinement | 1.152 |
Diffraction radiation wavelength | 0.71075 Å |
Diffraction radiation type | MoKα |