Information card for entry 7701688
Formula | C101 H120 As4 N4 Sn2 |
Calculated formula | C101 H120 As4 N4 Sn2 |
Title of publication | Synthesis and structural characterization of arsinoamides - early transition metal (Zr and Hf) and main group metal (Al, In, Sn, and Pb) complexes. |
Authors of publication | Chen, Xiao; Gamer, Michael T.; Roesky, Peter W. |
Journal of publication | Dalton transactions (Cambridge, England : 2003) |
Year of publication | 2019 |
Journal volume | 48 |
Journal issue | 40 |
Pages of publication | 15207 - 15211 |
a | 23.6642 ± 0.0005 Å |
b | 23.6642 ± 0.0005 Å |
c | 31.7406 ± 0.0008 Å |
α | 90° |
β | 90° |
γ | 90° |
Cell volume | 17774.6 ± 0.7 Å3 |
Cell temperature | 100 K |
Ambient diffraction temperature | 100 K |
Number of distinct elements | 5 |
Space group number | 88 |
Hermann-Mauguin space group symbol | I 41/a :2 |
Hall space group symbol | -I 4ad |
Residual factor for all reflections | 0.1052 |
Residual factor for significantly intense reflections | 0.0539 |
Weighted residual factors for significantly intense reflections | 0.1158 |
Weighted residual factors for all reflections included in the refinement | 0.1352 |
Goodness-of-fit parameter for all reflections included in the refinement | 0.985 |
Diffraction radiation wavelength | 0.71073 Å |
Diffraction radiation type | MoKα |