Information card for entry 7701708
Formula | C54 H78 B2 N6 |
Calculated formula | C54 H78 B2 N6 |
Title of publication | Synthetic, structural and reaction chemistry of N-heterocyclic germylene and stannylene compounds featuring N-boryl substituents. |
Authors of publication | Kristinsdóttir, Lilja; Oldroyd, Nicola L.; Grabiner, Rachel; Knights, Alastair W.; Heilmann, Andreas; Protchenko, Andrey V.; Niu, Haoyu; Kolychev, Eugene L.; Campos, Jesús; Hicks, Jamie; Christensen, Kirsten E.; Aldridge, Simon |
Journal of publication | Dalton transactions (Cambridge, England : 2003) |
Year of publication | 2019 |
Journal volume | 48 |
Journal issue | 31 |
Pages of publication | 11951 - 11960 |
a | 14.2417 ± 0.0002 Å |
b | 22.3662 ± 0.0004 Å |
c | 16.4812 ± 0.0003 Å |
α | 90° |
β | 97.5685 ± 0.0008° |
γ | 90° |
Cell volume | 5204.07 ± 0.15 Å3 |
Cell temperature | 150 K |
Ambient diffraction temperature | 150 K |
Number of distinct elements | 4 |
Space group number | 4 |
Hermann-Mauguin space group symbol | P 1 21 1 |
Hall space group symbol | P 2yb |
Residual factor for all reflections | 0.0908 |
Residual factor for significantly intense reflections | 0.0611 |
Weighted residual factors for all reflections | 0.1562 |
Weighted residual factors for significantly intense reflections | 0.1292 |
Weighted residual factors for all reflections included in the refinement | 0.1562 |
Goodness-of-fit parameter for all reflections included in the refinement | 0.9471 |
Diffraction radiation wavelength | 0.71073 Å |
Diffraction radiation type | MoKα |