Information card for entry 7701710
Formula | C62.5 H89 B2 Ge N7 O2 |
Calculated formula | C62.5 H89 B2 Ge N7 O2 |
Title of publication | Synthetic, structural and reaction chemistry of N-heterocyclic germylene and stannylene compounds featuring N-boryl substituents. |
Authors of publication | Kristinsdóttir, Lilja; Oldroyd, Nicola L.; Grabiner, Rachel; Knights, Alastair W.; Heilmann, Andreas; Protchenko, Andrey V.; Niu, Haoyu; Kolychev, Eugene L.; Campos, Jesús; Hicks, Jamie; Christensen, Kirsten E.; Aldridge, Simon |
Journal of publication | Dalton transactions (Cambridge, England : 2003) |
Year of publication | 2019 |
Journal volume | 48 |
Journal issue | 31 |
Pages of publication | 11951 - 11960 |
a | 42.2093 ± 0.0012 Å |
b | 42.2093 ± 0.0012 Å |
c | 13.867 ± 0.0005 Å |
α | 90° |
β | 90° |
γ | 90° |
Cell volume | 24705.8 ± 1.3 Å3 |
Cell temperature | 150 ± 2 K |
Ambient diffraction temperature | 150 ± 2 K |
Number of distinct elements | 6 |
Space group number | 88 |
Hermann-Mauguin space group symbol | I 41/a :2 |
Hall space group symbol | -I 4ad |
Residual factor for all reflections | 0.0733 |
Residual factor for significantly intense reflections | 0.052 |
Weighted residual factors for significantly intense reflections | 0.1384 |
Weighted residual factors for all reflections included in the refinement | 0.1527 |
Goodness-of-fit parameter for all reflections included in the refinement | 1.04 |
Diffraction radiation wavelength | 1.54184 Å |
Diffraction radiation type | CuKα |