Information card for entry 7701713
Formula | C58 H78 B2 N6 |
Calculated formula | C58 H78 B2 N6 |
Title of publication | Synthetic, structural and reaction chemistry of N-heterocyclic germylene and stannylene compounds featuring N-boryl substituents. |
Authors of publication | Kristinsdóttir, Lilja; Oldroyd, Nicola L.; Grabiner, Rachel; Knights, Alastair W.; Heilmann, Andreas; Protchenko, Andrey V.; Niu, Haoyu; Kolychev, Eugene L.; Campos, Jesús; Hicks, Jamie; Christensen, Kirsten E.; Aldridge, Simon |
Journal of publication | Dalton transactions (Cambridge, England : 2003) |
Year of publication | 2019 |
Journal volume | 48 |
Journal issue | 31 |
Pages of publication | 11951 - 11960 |
a | 10.911 ± 0.0001 Å |
b | 12.8255 ± 0.0001 Å |
c | 38.0195 ± 0.0005 Å |
α | 90° |
β | 90.504 ± 0.001° |
γ | 90° |
Cell volume | 5320.21 ± 0.09 Å3 |
Cell temperature | 150 ± 2 K |
Ambient diffraction temperature | 150 ± 2 K |
Number of distinct elements | 4 |
Space group number | 14 |
Hermann-Mauguin space group symbol | P 1 21/c 1 |
Hall space group symbol | -P 2ybc |
Residual factor for all reflections | 0.05 |
Residual factor for significantly intense reflections | 0.0436 |
Weighted residual factors for significantly intense reflections | 0.1113 |
Weighted residual factors for all reflections included in the refinement | 0.1169 |
Goodness-of-fit parameter for all reflections included in the refinement | 1.024 |
Diffraction radiation wavelength | 1.54184 Å |
Diffraction radiation type | CuKα |