Information card for entry 7701749
Mineral name |
Ce-UiO-66-Asp |
Formula |
C48 Ce12 N12 O102.2 |
Calculated formula |
C48 Ce12 N12 O102.2 |
Title of publication |
The first water-based synthesis of Ce(iv)-MOFs with saturated chiral and achiral C<sub>4</sub>-dicarboxylate linkers. |
Authors of publication |
Jacobsen, Jannick; Achenbach, Bastian; Reinsch, Helge; Smolders, Simon; Lange, Florian-David; Friedrichs, Gernot; De Vos, Dirk; Stock, Norbert |
Journal of publication |
Dalton transactions (Cambridge, England : 2003) |
Year of publication |
2019 |
Journal volume |
48 |
Journal issue |
23 |
Pages of publication |
8433 - 8441 |
a |
18.65148 ± 0.00016 Å |
b |
18.65148 ± 0.00016 Å |
c |
18.65148 ± 0.00016 Å |
α |
90° |
β |
90° |
γ |
90° |
Cell volume |
6488.43 ± 0.1 Å3 |
Ambient diffraction temperature |
298 K |
Number of distinct elements |
4 |
Space group number |
201 |
Hermann-Mauguin space group symbol |
P n -3 :1 |
Hall space group symbol |
P 2 2 3 -1n |
Diffraction radiation wavelength |
1.5406 Å |
Yes |
No |
No |