Information card for entry 7701751
Formula | C26 H19 Co N3 O8 |
Calculated formula | C26 H19 Co N3 O8 |
Title of publication | Hydrothermal generation, structural versatility and properties of metal(ii)-organic architectures driven by a pyridine-tricarboxylic acid. |
Authors of publication | Zhao, Na; Li, Yu; Gu, Jin-Zhong; Kirillova, Marina V.; Kirillov, Alexander M. |
Journal of publication | Dalton transactions (Cambridge, England : 2003) |
Year of publication | 2019 |
Journal volume | 48 |
Journal issue | 23 |
Pages of publication | 8361 - 8374 |
a | 7.4651 ± 0.0005 Å |
b | 12.887 ± 0.0009 Å |
c | 13.8979 ± 0.001 Å |
α | 113.506 ± 0.007° |
β | 105.246 ± 0.006° |
γ | 93.204 ± 0.005° |
Cell volume | 1163.22 ± 0.16 Å3 |
Cell temperature | 293 ± 2 K |
Ambient diffraction temperature | 293 ± 2 K |
Number of distinct elements | 5 |
Space group number | 2 |
Hermann-Mauguin space group symbol | P -1 |
Hall space group symbol | -P 1 |
Residual factor for all reflections | 0.0466 |
Residual factor for significantly intense reflections | 0.0378 |
Weighted residual factors for significantly intense reflections | 0.0854 |
Weighted residual factors for all reflections included in the refinement | 0.0926 |
Goodness-of-fit parameter for all reflections included in the refinement | 1.021 |
Diffraction radiation wavelength | 0.71073 Å |
Diffraction radiation type | MoKα |