Information card for entry 7701787
Formula | C99 H99 Cl10 N13 O28 Zn4 |
Calculated formula | C99 H97 Cl10 N13 O28 Zn4 |
Title of publication | Methoxy-substituted tetrakisquinoline analogs of EGTA and BAPTA for fluorescence detection of Cd<sup>2+</sup> . |
Authors of publication | Mikata, Yuji; Kaneda, Minori; Konno, Hideo; Matsumoto, Arimasa; Sato, Shin-Ichiro; Kawamura, Masaya; Iwatsuki, Satoshi |
Journal of publication | Dalton transactions (Cambridge, England : 2003) |
Year of publication | 2019 |
Journal volume | 48 |
Journal issue | 12 |
Pages of publication | 3840 - 3852 |
a | 23.639 ± 0.0013 Å |
b | 15.9622 ± 0.0009 Å |
c | 30.6105 ± 0.0018 Å |
α | 90° |
β | 112.1 ± 0.002° |
γ | 90° |
Cell volume | 10701.7 ± 1.1 Å3 |
Cell temperature | 153 K |
Ambient diffraction temperature | 153 K |
Number of distinct elements | 6 |
Space group number | 14 |
Hermann-Mauguin space group symbol | P 1 21/n 1 |
Hall space group symbol | -P 2yn |
Residual factor for all reflections | 0.0945 |
Residual factor for significantly intense reflections | 0.0673 |
Weighted residual factors for significantly intense reflections | 0.1603 |
Weighted residual factors for all reflections included in the refinement | 0.1818 |
Goodness-of-fit parameter for all reflections included in the refinement | 1.056 |
Diffraction radiation wavelength | 0.71075 Å |
Diffraction radiation type | MoKα |