Information card for entry 7701789
Formula | C62 H60 Cd2 Cl4 N10 O20 |
Calculated formula | C62 H56 Cd2 Cl4 N10 O20 |
Title of publication | Methoxy-substituted tetrakisquinoline analogs of EGTA and BAPTA for fluorescence detection of Cd<sup>2+</sup> . |
Authors of publication | Mikata, Yuji; Kaneda, Minori; Konno, Hideo; Matsumoto, Arimasa; Sato, Shin-Ichiro; Kawamura, Masaya; Iwatsuki, Satoshi |
Journal of publication | Dalton transactions (Cambridge, England : 2003) |
Year of publication | 2019 |
Journal volume | 48 |
Journal issue | 12 |
Pages of publication | 3840 - 3852 |
a | 12.3738 ± 0.0008 Å |
b | 17.9552 ± 0.0014 Å |
c | 18.3514 ± 0.0013 Å |
α | 103.789 ± 0.003° |
β | 90.889 ± 0.001° |
γ | 108.016 ± 0.003° |
Cell volume | 3747.9 ± 0.5 Å3 |
Cell temperature | 153 K |
Ambient diffraction temperature | 153 K |
Number of distinct elements | 6 |
Space group number | 2 |
Hermann-Mauguin space group symbol | P -1 |
Hall space group symbol | -P 1 |
Residual factor for all reflections | 0.0685 |
Residual factor for significantly intense reflections | 0.0584 |
Weighted residual factors for significantly intense reflections | 0.1533 |
Weighted residual factors for all reflections included in the refinement | 0.1653 |
Goodness-of-fit parameter for all reflections included in the refinement | 1.061 |
Diffraction radiation wavelength | 0.71075 Å |
Diffraction radiation type | MoKα |