Information card for entry 7701793
Formula | C67 H74 Br2 Cd2 Cl2 N6 O24 |
Calculated formula | C67 H71 Br2 Cd2 Cl2 N6 O24 |
Title of publication | Methoxy-substituted tetrakisquinoline analogs of EGTA and BAPTA for fluorescence detection of Cd<sup>2+</sup> . |
Authors of publication | Mikata, Yuji; Kaneda, Minori; Konno, Hideo; Matsumoto, Arimasa; Sato, Shin-Ichiro; Kawamura, Masaya; Iwatsuki, Satoshi |
Journal of publication | Dalton transactions (Cambridge, England : 2003) |
Year of publication | 2019 |
Journal volume | 48 |
Journal issue | 12 |
Pages of publication | 3840 - 3852 |
a | 13.614 ± 0.003 Å |
b | 16.137 ± 0.003 Å |
c | 20.661 ± 0.004 Å |
α | 72.534 ± 0.005° |
β | 85.863 ± 0.006° |
γ | 76.622 ± 0.006° |
Cell volume | 4212.2 ± 1.5 Å3 |
Cell temperature | 153 K |
Ambient diffraction temperature | 153 K |
Number of distinct elements | 7 |
Space group number | 2 |
Hermann-Mauguin space group symbol | P -1 |
Hall space group symbol | -P 1 |
Residual factor for all reflections | 0.0755 |
Residual factor for significantly intense reflections | 0.0555 |
Weighted residual factors for significantly intense reflections | 0.1618 |
Weighted residual factors for all reflections included in the refinement | 0.1824 |
Goodness-of-fit parameter for all reflections included in the refinement | 1.071 |
Diffraction radiation wavelength | 0.71075 Å |
Diffraction radiation type | MoKα |