Information card for entry 7702014
Common name | 3b |
Formula | C48 H52 Cl N O P2 Pt |
Calculated formula | C48 H52 Cl N O P2 Pt |
Title of publication | Cyclometallated platinum(II) complexes of benzylidene-2,6-di-isopropylphenylamine containing bidentate phosphines: synthesis, structural properties and reactivity studies. |
Authors of publication | Zheng, Feng; Hutton, Alan T.; van Sittert, Cornelia G. C. E.; Gerber, Wilhelmus J.; Mapolie, Selwyn F. |
Journal of publication | Dalton transactions (Cambridge, England : 2003) |
Year of publication | 2015 |
Journal volume | 44 |
Journal issue | 4 |
Pages of publication | 1969 - 1981 |
a | 9.8055 ± 0.0005 Å |
b | 39.311 ± 0.002 Å |
c | 11.2304 ± 0.0006 Å |
α | 90° |
β | 101.284 ± 0.001° |
γ | 90° |
Cell volume | 4245.2 ± 0.4 Å3 |
Cell temperature | 173 ± 2 K |
Ambient diffraction temperature | 173 ± 2 K |
Number of distinct elements | 7 |
Space group number | 14 |
Hermann-Mauguin space group symbol | P 1 21/c 1 |
Hall space group symbol | -P 2ybc |
Residual factor for all reflections | 0.043 |
Residual factor for significantly intense reflections | 0.0288 |
Weighted residual factors for significantly intense reflections | 0.0495 |
Weighted residual factors for all reflections included in the refinement | 0.0528 |
Goodness-of-fit parameter for all reflections included in the refinement | 1.02 |
Diffraction radiation wavelength | 0.71073 Å |
Diffraction radiation type | MoKα |