Information card for entry 7702020
Formula | C12 H52 N6 O29 V10 |
Calculated formula | C12 H40 N6 O29 V10 |
Title of publication | Solid-state transformation of single precursor vanadium complex nanostructures to V₂O₅ and VO₂: catalytic activity of V₂O₅ for oxidative coupling of 2-naphthol. |
Authors of publication | Pradhan, Mukul; Roy, Anindita; Sinha, Arun Kumar; Sahoo, Ramkrishna; Deb, Dibakar; Pal, Tarasankar |
Journal of publication | Dalton transactions (Cambridge, England : 2003) |
Year of publication | 2015 |
Journal volume | 44 |
Journal issue | 4 |
Pages of publication | 1889 - 1899 |
a | 13.867 ± 0.003 Å |
b | 18.913 ± 0.004 Å |
c | 30.893 ± 0.007 Å |
α | 90° |
β | 90° |
γ | 90° |
Cell volume | 8102 ± 3 Å3 |
Cell temperature | 293 ± 2 K |
Ambient diffraction temperature | 293 ± 2 K |
Number of distinct elements | 5 |
Space group number | 64 |
Hermann-Mauguin space group symbol | C m c e |
Hall space group symbol | -C 2ac 2 |
Residual factor for all reflections | 0.0881 |
Residual factor for significantly intense reflections | 0.0409 |
Weighted residual factors for significantly intense reflections | 0.0955 |
Weighted residual factors for all reflections included in the refinement | 0.1148 |
Goodness-of-fit parameter for all reflections included in the refinement | 1.021 |
Diffraction radiation wavelength | 0.71073 Å |
Diffraction radiation type | MoKα |