Information card for entry 7702250
Formula | C58 H66 Cl4 Lu4 N6 O20 |
Calculated formula | C58 H66 Cl4 Lu4 N6 O20 |
Title of publication | Linear-shaped Ln and Ln clusters constructed by a polydentate Schiff base ligand and a β-diketone co-ligand: structures, fluorescence properties, magnetic refrigeration and single-molecule magnet behavior. |
Authors of publication | Wang, Wen-Min; He, Li-Yuan; Wang, Xin-Xin; Shi, Ying; Wu, Zhi-Lei; Cui, Jian-Zhong |
Journal of publication | Dalton transactions (Cambridge, England : 2003) |
Year of publication | 2019 |
Journal volume | 48 |
Journal issue | 44 |
Pages of publication | 16744 - 16755 |
a | 8.56 ± 0.0004 Å |
b | 14.0982 ± 0.0007 Å |
c | 14.3191 ± 0.0006 Å |
α | 96.775 ± 0.002° |
β | 94.875 ± 0.002° |
γ | 101.833 ± 0.002° |
Cell volume | 1668.88 ± 0.13 Å3 |
Cell temperature | 150 ± 2 K |
Ambient diffraction temperature | 150 K |
Number of distinct elements | 6 |
Space group number | 2 |
Hermann-Mauguin space group symbol | P -1 |
Hall space group symbol | -P 1 |
Residual factor for all reflections | 0.0383 |
Residual factor for significantly intense reflections | 0.0291 |
Weighted residual factors for significantly intense reflections | 0.0656 |
Weighted residual factors for all reflections included in the refinement | 0.0691 |
Goodness-of-fit parameter for all reflections included in the refinement | 1.04 |
Diffraction radiation wavelength | 0.71073 Å |
Diffraction radiation type | MoKα |