Information card for entry 7702884
Formula | C20 H21 Cl2 Fe N9 O |
Calculated formula | C20 H21 Cl2 Fe N9 O |
Title of publication | Pyrazolyl methyls prescribe the electronic properties of iron(II) tetra(pyrazolyl)lutidine chloride complexes. |
Authors of publication | Morin, Tyler J.; Wanniarachchi, Sarath; Gwengo, Chengeto; Makura, Vitales; Tatlock, Heidi M.; Lindeman, Sergey V.; Bennett, Brian; Long, Gary J.; Grandjean, Fernande; Gardinier, James R. |
Journal of publication | Dalton transactions (Cambridge, England : 2003) |
Year of publication | 2011 |
Journal volume | 40 |
Journal issue | 31 |
Pages of publication | 8024 - 8034 |
a | 21.641 ± 0.004 Å |
b | 22.294 ± 0.004 Å |
c | 9.5986 ± 0.0019 Å |
α | 90° |
β | 90° |
γ | 90° |
Cell volume | 4631 ± 1.5 Å3 |
Cell temperature | 100 K |
Ambient diffraction temperature | 100 K |
Number of distinct elements | 6 |
Space group number | 64 |
Hermann-Mauguin space group symbol | C m c e |
Hall space group symbol | -C 2ac 2 |
Residual factor for all reflections | 0.0278 |
Residual factor for significantly intense reflections | 0.0234 |
Weighted residual factors for significantly intense reflections | 0.0663 |
Weighted residual factors for all reflections included in the refinement | 0.0678 |
Goodness-of-fit parameter for all reflections included in the refinement | 1.096 |
Diffraction radiation wavelength | 0.7107 Å |
Diffraction radiation type | MoKα |