Information card for entry 7702907
Formula |
C46 H30 In3 N7 O24 |
Calculated formula |
C46 H30.0006 In3 N7 O24 |
Title of publication |
A hydrolytically stable anionic layered indium‒organic framework for the efficient removal of 90Sr from seawater |
Authors of publication |
Li, Guodong; Ji, Guoxun; Liu, Wei; Zhang, Jiarong; Song, Liping; Cheng, Liwei; Wang, Xia; Wang, Yanlong; Liu, Jianjun; Chen, Xudan; Sun, Xinli; Diwu, Juan |
Journal of publication |
Dalton Transactions |
Year of publication |
2019 |
a |
15.7163 ± 0.0018 Å |
b |
15.7163 ± 0.0018 Å |
c |
52.205 ± 0.01 Å |
α |
90° |
β |
90° |
γ |
120° |
Cell volume |
11167 ± 3 Å3 |
Cell temperature |
296 ± 2 K |
Ambient diffraction temperature |
296 ± 2 K |
Number of distinct elements |
5 |
Space group number |
167 |
Hermann-Mauguin space group symbol |
R -3 c :H |
Hall space group symbol |
-R 3 2"c |
Residual factor for all reflections |
0.0856 |
Residual factor for significantly intense reflections |
0.0516 |
Weighted residual factors for significantly intense reflections |
0.1368 |
Weighted residual factors for all reflections included in the refinement |
0.1496 |
Goodness-of-fit parameter for all reflections included in the refinement |
1.08 |
Diffraction radiation wavelength |
0.71073 Å |
Diffraction radiation type |
MoKα |
Yes |
No |
No |