Information card for entry 7704902
Formula | C65 H71 Ca N2 O P Sn |
Calculated formula | C65 H71 Ca N2 O P Sn |
Title of publication | Synthesis and reactivity of alkaline-earth stannanide complexes by hydride-mediated distannane metathesis and organostannane dehydrogenation. |
Authors of publication | Morris, Louis J.; Rajabi, Nasir A.; Mahon, Mary F.; Manners, Ian; McMullin, Claire L.; Hill, Michael S. |
Journal of publication | Dalton transactions (Cambridge, England : 2003) |
Year of publication | 2020 |
Journal volume | 49 |
Journal issue | 30 |
Pages of publication | 10523 - 10534 |
a | 13.8086 ± 0.0001 Å |
b | 16.6672 ± 0.0001 Å |
c | 25.6761 ± 0.0002 Å |
α | 90° |
β | 103.509 ± 0.001° |
γ | 90° |
Cell volume | 5745.88 ± 0.07 Å3 |
Cell temperature | 150 ± 0.1 K |
Ambient diffraction temperature | 150 ± 0.1 K |
Number of distinct elements | 7 |
Space group number | 14 |
Hermann-Mauguin space group symbol | P 1 21/c 1 |
Hall space group symbol | -P 2ybc |
Residual factor for all reflections | 0.0381 |
Residual factor for significantly intense reflections | 0.0304 |
Weighted residual factors for significantly intense reflections | 0.0682 |
Weighted residual factors for all reflections included in the refinement | 0.0711 |
Goodness-of-fit parameter for all reflections included in the refinement | 1.017 |
Diffraction radiation probe | x-ray |
Diffraction radiation wavelength | 1.54184 Å |
Diffraction radiation type | CuKα |