Information card for entry 7705503
Formula | C98 H82 F24 Lu2 N12 O5 |
Calculated formula | C98 H82 F24 Lu2 N12 O5 |
Title of publication | Widely contrasting outcomes from the use of tris(pentafluorophenyl)bismuth or pentafluorophenylsilver as oxidants in the reactions of lanthanoid metals with <i>N</i>,<i>N</i>'-diarylformamidines. |
Authors of publication | Guo, Zhifang; Blair, Victoria L.; Deacon, Glen B.; Junk, Peter C. |
Journal of publication | Dalton transactions (Cambridge, England : 2003) |
Year of publication | 2020 |
Journal volume | 49 |
Journal issue | 39 |
Pages of publication | 13588 - 13600 |
a | 10.6678 ± 0.0001 Å |
b | 11.6671 ± 0.0001 Å |
c | 19.4498 ± 0.0002 Å |
α | 82.422 ± 0.001° |
β | 77.196 ± 0.001° |
γ | 88.771 ± 0.001° |
Cell volume | 2339.88 ± 0.04 Å3 |
Cell temperature | 123 ± 2 K |
Ambient diffraction temperature | 123 ± 2 K |
Number of distinct elements | 6 |
Space group number | 2 |
Hermann-Mauguin space group symbol | P -1 |
Hall space group symbol | -P 1 |
Residual factor for all reflections | 0.028 |
Residual factor for significantly intense reflections | 0.0241 |
Weighted residual factors for significantly intense reflections | 0.0559 |
Weighted residual factors for all reflections included in the refinement | 0.0574 |
Goodness-of-fit parameter for all reflections included in the refinement | 1.057 |
Diffraction radiation wavelength | 0.71073 Å |
Diffraction radiation type | MoKα |