Information card for entry 7706171
Formula | C29 H28 Mn N3 O6 |
Calculated formula | C29 H28 Mn N3 O6 |
Title of publication | Deciphering supramolecular isomerization in coordination polymers: connected molecular squares <i>vs.</i> fused hexagons. |
Authors of publication | Gupta, Vijay; Laha, Biswajit; Khullar, Sadhika; Mandal, Sanjay K. |
Journal of publication | Dalton transactions (Cambridge, England : 2003) |
Year of publication | 2021 |
Journal volume | 50 |
Journal issue | 6 |
Pages of publication | 2221 - 2232 |
a | 9.181 ± 0.003 Å |
b | 9.845 ± 0.003 Å |
c | 17.095 ± 0.006 Å |
α | 94.855 ± 0.006° |
β | 102.083 ± 0.006° |
γ | 115.96 ± 0.005° |
Cell volume | 1330.9 ± 0.8 Å3 |
Cell temperature | 296 ± 2 K |
Ambient diffraction temperature | 296.15 K |
Number of distinct elements | 5 |
Space group number | 2 |
Hermann-Mauguin space group symbol | P -1 |
Hall space group symbol | -P 1 |
Residual factor for all reflections | 0.0294 |
Residual factor for significantly intense reflections | 0.0258 |
Weighted residual factors for significantly intense reflections | 0.0654 |
Weighted residual factors for all reflections included in the refinement | 0.0677 |
Goodness-of-fit parameter for all reflections included in the refinement | 1.027 |
Diffraction radiation probe | x-ray |
Diffraction radiation wavelength | 0.71073 Å |
Diffraction radiation type | MoKα |