Information card for entry 7706177
Formula | C30 H18 Co N6 S2 |
Calculated formula | C30 H18 Co N6 S2 |
Title of publication | Magnetism in a helicate complexes arising with the tetradentate ligand. |
Authors of publication | Ohmagari, Hitomi; Nakaya, Manabu; Tanaka, Kaisei; Zenno, Hikaru; Akiyoshi, Ryohei; Sekine, Yoshihiro; Zhang, Yingjie; Min, Kil Sik; Hasegawa, Miki; Lindoy, Leonard F.; Hayami, Shinya |
Journal of publication | Dalton transactions (Cambridge, England : 2003) |
Year of publication | 2021 |
Journal volume | 50 |
Journal issue | 2 |
Pages of publication | 494 - 498 |
a | 12.625 ± 0.003 Å |
b | 13.462 ± 0.003 Å |
c | 15.605 ± 0.003 Å |
α | 90° |
β | 99.03 ± 0.03° |
γ | 90° |
Cell volume | 2619.3 ± 1 Å3 |
Cell temperature | 100 ± 2 K |
Ambient diffraction temperature | 100 K |
Number of distinct elements | 5 |
Space group number | 15 |
Hermann-Mauguin space group symbol | C 1 2/c 1 |
Hall space group symbol | -C 2yc |
Residual factor for all reflections | 0.0563 |
Residual factor for significantly intense reflections | 0.0516 |
Weighted residual factors for significantly intense reflections | 0.141 |
Weighted residual factors for all reflections included in the refinement | 0.1454 |
Goodness-of-fit parameter for all reflections included in the refinement | 1.0794 |
Diffraction radiation wavelength | 0.71074 Å |
Diffraction radiation type | MoKα |