Information card for entry 7706239
Formula | C40 H63 Cl N2 O P2 Ti |
Calculated formula | C40 H63 Cl N2 O P2 Ti |
Title of publication | Experimental and theoretical investigation of the reactivity of [(BDI*)Ti(Cl){η<sup>2</sup>-P(SiMe<sub>3</sub>)-P<i>i</i>Pr<sub>2</sub>}] towards selected ketones. |
Authors of publication | Ziółkowska, Aleksandra; Szynkiewicz, Natalia; Ponikiewski, Łukasz |
Journal of publication | Dalton transactions (Cambridge, England : 2003) |
Year of publication | 2021 |
Journal volume | 50 |
Journal issue | 4 |
Pages of publication | 1390 - 1401 |
a | 8.987 ± 0.0007 Å |
b | 12.3952 ± 0.001 Å |
c | 18.1785 ± 0.0014 Å |
α | 90.89 ± 0.006° |
β | 99.601 ± 0.006° |
γ | 93.077 ± 0.006° |
Cell volume | 1993.1 ± 0.3 Å3 |
Cell temperature | 120 ± 2 K |
Ambient diffraction temperature | 120 ± 2 K |
Number of distinct elements | 7 |
Space group number | 2 |
Hermann-Mauguin space group symbol | P -1 |
Hall space group symbol | -P 1 |
Residual factor for all reflections | 0.2487 |
Residual factor for significantly intense reflections | 0.1022 |
Weighted residual factors for significantly intense reflections | 0.2384 |
Weighted residual factors for all reflections included in the refinement | 0.3134 |
Goodness-of-fit parameter for all reflections included in the refinement | 0.995 |
Diffraction radiation probe | x-ray |
Diffraction radiation wavelength | 0.71073 Å |
Diffraction radiation type | MoKα |