Information card for entry 7706323
Formula | C36 H30 F12 N12 P2 Zn |
Calculated formula | C36 H30 F12 N12 P2 Zn |
Title of publication | Tuning spin-crossover transition temperatures in non-symmetrical homoleptic meridional/facial [Fe(didentate)<sub>3</sub>]<sup>2+</sup> complexes: what for and who cares about it? |
Authors of publication | Deorukhkar, Neel; Besnard, Céline; Guénée, Laure; Piguet, Claude |
Journal of publication | Dalton transactions (Cambridge, England : 2003) |
Year of publication | 2021 |
Journal volume | 50 |
Journal issue | 4 |
Pages of publication | 1206 - 1223 |
a | 13.58526 ± 0.00012 Å |
b | 10.68649 ± 0.00011 Å |
c | 27.084 ± 0.0003 Å |
α | 90° |
β | 91.932 ± 0.0009° |
γ | 90° |
Cell volume | 3929.79 ± 0.07 Å3 |
Cell temperature | 149.99 ± 0.1 K |
Ambient diffraction temperature | 149.99 ± 0.1 K |
Number of distinct elements | 6 |
Space group number | 14 |
Hermann-Mauguin space group symbol | P 1 21/c 1 |
Hall space group symbol | -P 2ybc |
Residual factor for all reflections | 0.0539 |
Residual factor for significantly intense reflections | 0.0505 |
Weighted residual factors for significantly intense reflections | 0.14 |
Weighted residual factors for all reflections included in the refinement | 0.1429 |
Goodness-of-fit parameter for all reflections included in the refinement | 1.058 |
Diffraction radiation probe | x-ray |
Diffraction radiation wavelength | 1.54184 Å |
Diffraction radiation type | CuKα |