Information card for entry 7706365
Chemical name | Pt6 cluster |
Formula | C14 H40 P6 Pt3 |
Calculated formula | C14 H40 P6 Pt3 |
Title of publication | Synthesis and characterisation of boranediyl- and diboranediyl-bridged diplatinum A-frame complexes. |
Authors of publication | Brunecker, Carina; Arrowsmith, Merle; Müssig, Jonas H; Böhnke, Julian; Stoy, Andreas; Heß, Merlin; Hofmann, Alexander; Lenczyk, Carsten; Lichtenberg, Crispin; Ramler, Jacqueline; Rempel, Anna; Braunschweig, Holger |
Journal of publication | Dalton transactions (Cambridge, England : 2003) |
Year of publication | 2021 |
Journal volume | 50 |
Journal issue | 10 |
Pages of publication | 3506 - 3515 |
a | 9.6196 ± 0.0004 Å |
b | 11.6672 ± 0.0005 Å |
c | 12.3195 ± 0.0005 Å |
α | 111.422 ± 0.001° |
β | 93.24 ± 0.001° |
γ | 92.752 ± 0.001° |
Cell volume | 1281.58 ± 0.09 Å3 |
Cell temperature | 100 ± 2 K |
Ambient diffraction temperature | 100 ± 2 K |
Number of distinct elements | 4 |
Space group number | 2 |
Hermann-Mauguin space group symbol | P -1 |
Hall space group symbol | -P 1 |
Residual factor for all reflections | 0.062 |
Residual factor for significantly intense reflections | 0.0601 |
Weighted residual factors for significantly intense reflections | 0.1711 |
Weighted residual factors for all reflections included in the refinement | 0.1741 |
Goodness-of-fit parameter for all reflections included in the refinement | 1.028 |
Diffraction radiation wavelength | 0.71073 Å |
Diffraction radiation type | MoKα |