Information card for entry 7706454
Formula | F2.5 H16 N6.5 O7 Ru |
Calculated formula | F2.5 H12 N6.25 O6.25 Ru |
Title of publication | Remarkable thermal stability of light-induced Ru-ON linkage isomers in mixed salts of a ruthenium amine complex with a <i>trans</i>-ON-Ru-F coordinate. |
Authors of publication | Mikhailov, Artem A.; Sukhikh, Taisiya S.; Kuratieva, Natalia V.; Pishchur, Denis P.; Kostin, Gennadiy A. |
Journal of publication | Dalton transactions (Cambridge, England : 2003) |
Year of publication | 2021 |
Journal volume | 50 |
Journal issue | 8 |
Pages of publication | 2864 - 2871 |
a | 16.8917 ± 0.0006 Å |
b | 16.8917 ± 0.0006 Å |
c | 7.7823 ± 0.0005 Å |
α | 90° |
β | 90° |
γ | 90° |
Cell volume | 2220.52 ± 0.18 Å3 |
Cell temperature | 150 ± 2 K |
Ambient diffraction temperature | 150 ± 2 K |
Number of distinct elements | 5 |
Space group number | 87 |
Hermann-Mauguin space group symbol | I 4/m |
Hall space group symbol | -I 4 |
Residual factor for all reflections | 0.0466 |
Residual factor for significantly intense reflections | 0.0459 |
Weighted residual factors for significantly intense reflections | 0.113 |
Weighted residual factors for all reflections included in the refinement | 0.1134 |
Goodness-of-fit parameter for all reflections included in the refinement | 1.248 |
Diffraction radiation wavelength | 0.71073 Å |
Diffraction radiation type | MoKα |